NO,����,����_�J�i,�Z��,����,�ܓx,�o�x,�W��,�d�b�ԍ�,�����ԍ�,�s�撬���R�[�h,�s���{����,�s�撬����,�ЊQ���_�^��,�ЊQ���_�R����A�y�Η��y�ђn����,�ЊQ���_����,�ЊQ���_�n�k,�ЊQ���_�Ôg,�ЊQ���_��K�͂ȉΎ�,�ЊQ���_�����×�,�ЊQ���_�ΎR����,�w����Ƃ̏d��,�z����e�l��,�ΏۂƂȂ钬��E������,URL,���l
1,�z�m�ʌ𗬃Z���^�[,�I�`�����R�E�����E�Z���^�[,���m�������S�������c��X1285,,33.25.57,132.56.40,497,,,394050,���m��,������,,,,1,,1,,,1,66�l(485�u),�z�m�ʋ掩��h�Љ�,,
2,���l���쏬�w�Z,�L���E�V�}�K���V���E�K�b�R�E,���m�������S�������x�i438,,33.25.52,132.52.39,495.4,,,394050,���m��,������,,1,,,,,,,1,166�l(1838�u),�l����掩��h�Љ�,,���q�͑΍�����
3,�l����𗬃Z���^�[,�V�}�K���R�E�����E�Z���^�[,���m�������S�������Z��153,,33.25.44,132.52.33,486.7,,,394050,���m��,������,,,,1,,1,,,1,60�l(473�u),�l����掩��h�Љ�,,
4,�䂷�͂�E���E������,���X�n���E�����E�~���C�J��,���m�������S����������1426,,33.23.29,132.55.36,409.3,0889-40-2177,,394050,���m��,������,,1,,1,,1,,,1,200�l(1518�u),���掩��h�Љ�,,
5,�h�Ћ��_�{��,�{�E�T�C�L���e���V�Z�c,���m�������S����������1428,,33.23.29,132.55.38,409.3,,,394050,���m��,������,,1,,1,,1,,,1,33�l(395�u),���掩��h�Љ�,,
6,���ᑐ�ۈ珊,�L���E���J�N�T�z�C�N�V��,���m�������S����������1437,,33.23.33,132.55.32,411.1,,,394051,���m��,������,,1,,1,,1,,,,,,,
7,���搶�U�w�K��,�j�V�N�V���E�K�C�K�N�V���E�J��,���m�������S�������L��167,,33.23.58,132.53.18,444.5,,,394052,���m��,������,,,,1,,1,,,1,50�l(370�u),���掩��h�Љ�,,
8,���̉�,�^�J�g���m�C�G,���m�������S���������ܓn210,,33.21.38,132.59.02,333.6,0889-62-2401,,394050,���m��,������,,1,,1,,1,,,1,21�l(522�u),�����掩��h�Љ�,,
9,�����ӂꂠ���Z���^�[,�}�c�o���t���A�C�Z���^�[,���m�������S����������572,,33.18.43,132.58.27,268,0889-66-0021,,394050,���m��,������,,,,1,,1,,,1,42�l(629�u),�����掩��h�Љ�,,
,,,,,,,,,,,,,,,,,,,,,,,,,
,,,,,,,,,,,,,,,,,,,,,,,,,
,,,,,,,,,,,,,,,,,,,,,,,,,
,,,,,,,,,,,,,,,,,,,,,,,,,
,,,,,,,,,,,,,,,,,,,,,,,,,
,,,,,,,,,,,,,,,,,,,,,,,,,
,,,,,,,,,,,,,,,,,,,,,,,,,
,,,,,,,,,,,,,,,,,,,,,,,,,
,,,,,,,,,,,,,,,,,,,,,,,,,
,,,,,,,,,,,,,,,,,,,,,,,,,
,,,,,,,,,,,,,,,,,,,,,,,,,
